doom3 ошибка при сборке

В общем, пытаюсь поставить третий дум, выдает
 /usr/include/c++/8.2.1/bits/std_abs.h:56:3: note: candidate: 'long int std::abs(long int)'
   abs(long __i) { return __builtin_labs(__i); }
   ^~~
scons: *** [build/release/core/sys/linux/sound.o] Error 1
scons: building terminated because of errors.
==> ERROR: A failure occurred in build().
    Aborting...
В ауре человек написал
Changing the line to

if ( abs( (double)(m_speed - PRIMARYFREQ) ) > 5 ) {

got it going.
Вопрос, куда это воткнуть то? Кто подскажет?
Ошибку не видно. Не всё скопировали.
такие дела.
sys/linux/sound.cpp: In member function 'virtual bool idAudioHardwareOSS::Initialize()':
sys/linux/sound.cpp:282:34: error: call of overloaded 'abs(unsigned int)' is ambiguous
  if ( abs( m_speed - PRIMARYFREQ ) > 5 ) {
                                  ^
In file included from /usr/include/c++/8.2.1/cstdlib:75,
                 from /usr/include/c++/8.2.1/stdlib.h:36,
                 from sys/linux/../../idlib/precompiled.h:97,
                 from sys/linux/sound.cpp:39:
/usr/include/stdlib.h:837:12: note: candidate: 'int abs(int)'
 extern int abs (int __x) __THROW __attribute__ ((__const__)) __wur;
            ^~~
In file included from /usr/include/c++/8.2.1/cstdlib:77,
                 from /usr/include/c++/8.2.1/stdlib.h:36,
                 from sys/linux/../../idlib/precompiled.h:97,
                 from sys/linux/sound.cpp:39:
/usr/include/c++/8.2.1/bits/std_abs.h:102:3: note: candidate: 'constexpr __float128 std::abs(__float128)'
   abs(__float128 __x)
   ^~~
/usr/include/c++/8.2.1/bits/std_abs.h:78:3: note: candidate: 'constexpr long double std::abs(long double)'
   abs(long double __x)
   ^~~
/usr/include/c++/8.2.1/bits/std_abs.h:74:3: note: candidate: 'constexpr float std::abs(float)'
   abs(float __x)
   ^~~
/usr/include/c++/8.2.1/bits/std_abs.h:70:3: note: candidate: 'constexpr double std::abs(double)'
   abs(double __x)
   ^~~
/usr/include/c++/8.2.1/bits/std_abs.h:61:3: note: candidate: 'long long int std::abs(long long int)'
   abs(long long __x) { return __builtin_llabs (__x); }
   ^~~
/usr/include/c++/8.2.1/bits/std_abs.h:56:3: note: candidate: 'long int std::abs(long int)'
   abs(long __i) { return __builtin_labs(__i); }
   ^~~
scons: *** [build/release/core/sys/linux/sound.o] Error 1
scons: building terminated because of errors.
==> ERROR: A failure occurred in build().
    Aborting...
Error making: doom3
undemeon
куда это воткнуть то?
А что в этом месте? - sys/linux/sound.cpp:282:34 .... немного выше и немного ниже (в смысле, что там за конструкция)

EDIT 1 - насколько я понял, у тебя там сейчас if ( abs( m_speed - PRIMARYFREQ ) > 5 ) {, а предлагают изменить на
if ( abs( (double)(m_speed - PRIMARYFREQ) ) > 5 ) {
Ошибки не исчезают с опытом - они просто умнеют
В общем это пакет из аура, тот кто его выкладывал мышей не ловит, и забил давно,в итоге поставил doom3-bin где эту глюку уже кто то исправил, но все равно интересно, это исходники править нужно что ли или чего? я в этой теме не секу как то.
А есть ссылки на норм сборку?
http://captchaforum.com/
 
Зарегистрироваться или войдите чтобы оставить сообщение.